1. Diese Seite verwendet Cookies. Wenn du dich weiterhin auf dieser Seite aufhältst, akzeptierst du unseren Einsatz von Cookies. Weitere Informationen

DarwinPorts

Dieses Thema im Forum "OS X-Developer" wurde erstellt von AmishBit, 22.12.05.

  1. AmishBit

    AmishBit Gast

    Wenn ich versuche mit der neuesten Version von DarwinPorts das Paket "openal" zu installieren, kommt folgende Fehlermeldung:
    Code:
    Last login: Thu Dec 22 13:51:28 on ttyp1
    Welcome to Darwin!
    powerbook-g4-17:~ viktorbaluch$ sudo port install openal
    --->  Building openal
    Error: Target com.apple.build returned: shell command "cd "/opt/local/var/db/dports/build/_opt_local_var_db_dports_sources_rsync.rsync.darwinports.org_dpupdate_dports_audio_openal/work/openal/macosx" && /usr/bin/xcodebuild -project al_osx.xcode" returned error 1
    Command output: (NOTE: project al_osx was written by an older version of Xcode (39) -- temporarily upgrading it to version 42 (without modifying project file))
    
    === BUILDING LIBRARY TARGET openal.dylib WITH THE DEFAULT CONFIGURATION (Default) ===
    
    Checking Dependencies...
    
    JamToolExecution openal.dylib
        cd /opt/local/var/db/dports/build/_opt_local_var_db_dports_sources_rsync.rsync.darwinports.org_dpupdate_dports_audio_openal/work/openal/macosx
        setenv ASCII_OUTPUT_ANNOTATION YES
        setenv ENABLE_APPLE_JAM_EXTENSIONS YES
        setenv ENABLE_APPLE_JAM_OUTPUT_ANNOTATION YES
        setenv GROUP wheel
        setenv NATIVE_ARCH ppc
        setenv USER root
        /Developer/Private/jam -d2 -j1 JAMBASE=/Developer/Makefiles/pbx_jamfiles/ProjectBuilderJambase JAMFILE=/opt/local/var/db/dports/build/_opt_local_var_db_dports_sources_rsync.rsync.darwinports.org_dpupdate_dports_audio_openal/work/openal/macosx/build/al_osx.build/Default/openal.dylib.build/openal.dylib.jam build ACTION=build _DEFAULT_GCC_VERSION=4.0 GCC_VERSION_IDENTIFIER=4_0 CONFIGURATION=Default BUILD_STYLE=Default CPP_HEADERMAP_FILE=/opt/local/var/db/dports/build/_opt_local_var_db_dports_sources_rsync.rsync.darwinports.org_dpupdate_dports_audio_openal/work/openal/macosx/build/al_osx.build/Default/openal.dylib.build/openal.dylib.hmap SRCROOT=/opt/local/var/db/dports/build/_opt_local_var_db_dports_sources_rsync.rsync.darwinports.org_dpupdate_dports_audio_openal/work/openal/macosx OBJROOT=/opt/local/var/db/dports/build/_opt_local_var_db_dports_sources_rsync.rsync.darwinports.org_dpupdate_dports_audio_openal/work/openal/macosx/build SYMROOT=/opt/local/var/db/dports/build/_opt_local_var_db_dports_sources_rsync.rsync.darwinports.org_dpupdate_dports_audio_openal/work/openal/macosx/build DSTROOT=/tmp/al_osx.dst
    
    CompileCplusplus /opt/local/var/db/dports/build/_opt_local_var_db_dports_sources_rsync.rsync.darwinports.org_dpupdate_dports_audio_openal/work/openal/macosx/build/al_osx.build/Default/openal.dylib.build/Objects-normal/ppc/oalContext.o oalContext.cpp
        /usr/bin/g++-4.0  -c -I/opt/local/var/db/dports/build/_opt_local_var_db_dports_sources_rsync.rsync.darwinports.org_dpupdate_dports_audio_openal/work/openal/macosx/build/al_osx.build/Default/openal.dylib.build/openal.dylib.hmap   -F/opt/local/var/db/dports/build/_opt_local_var_db_dports_sources_rsync.rsync.darwinports.org_dpupdate_dports_audio_openal/work/openal/macosx/build/Default  -I/opt/local/var/db/dports/build/_opt_local_var_db_dports_sources_rsync.rsync.darwinports.org_dpupdate_dports_audio_openal/work/openal/macosx/build/Default/include  -arch ppc -fno-common -fpascal-strings -O3 -Wmost -Wno-four-char-constants -Wno-unknown-pragmas -pipe "-fmessage-length=0"       oalContext.cpp  -o /opt/local/var/db/dports/build/_opt_local_var_db_dports_sources_rsync.rsync.darwinports.org_dpupdate_dports_audio_openal/work/openal/macosx/build/al_osx.build/Default/openal.dylib.build/Objects-normal/ppc/oalContext.o 
    oalDevice.h:225: error: redefinition of 'struct MixerDistanceParams'
    /System/Library/Frameworks/AudioUnit.framework/Headers/AudioUnitProperties.h:1012: error: previous definition of 'struct MixerDistanceParams'
    oalDevice.h:229: error: invalid type in declaration before ';' token
    oalDevice.h:229: error: conflicting declaration 'typedef int MixerDistanceParams'
    /System/Library/Frameworks/AudioUnit.framework/Headers/AudioUnitProperties.h:1016: error: 'MixerDistanceParams' has a previous declaration as 'typedef struct MixerDistanceParams MixerDistanceParams'
    oalDevice.h:232: error: conflicting declaration 'kAudioUnitProperty_3DMixerDistanceParams'
    /System/Library/Frameworks/AudioUnit.framework/Headers/AudioUnitProperties.h:125: error: 'kAudioUnitProperty_3DMixerDistanceParams' has a previous declaration as '<anonymous enum> kAudioUnitProperty_3DMixerDistanceParams'
    ** BUILD FAILED **
    
    Error: /opt/local/bin/port: Status 1 encountered during processing.
    powerbook-g4-17:~ viktorbaluch$ 

    Ich verwende 10.4.3 und habe XCode 2.2 .
     

Diese Seite empfehlen